Reaction Details
TargetUDP-glucuronosyltransferase 2B10
LigandBDBM50022815
Substrate/CompetitorDiclofenac
Meas. Tech.UDP-glucuronosyltransferase Activity Assay
IC50>3.00e+5±n/a nM
Citation Liu, YShe, MWu, ZDai, R The inhibition study of human UDP-glucuronosyltransferases with cytochrome P450 selective substrates and inhibitors. J Enzyme Inhib Med Chem26:386-93 (2011) 
 
UDP-glucuronosyltransferase 2B10
Name:UDP-glucuronosyltransferase 2B10
Type:Enzyme
Mol. Mass.:60792.40
Organism:Homo sapiens (Human)
Description:P36537
Residue:528
BDBM50022815
Diclofenac
NameBDBM50022815
Synonyms:(3S,6S,9S,12R,15S,18S,21S,24S,30S,33S)-30-ethyl-33-[(1R,2R,4E)-1-hydroxy-2-methylhex-4-en-1-yl]-1,4,7,10,12,15,19,25,28-nonamethyl-6,9,18,24-tetrakis(2-methylpropyl)-3,21-bis(propan-2-yl)-1,4,7,10,13,16,19,22,25,28,31-undecaazacyclotritriacontan-2,5,8,11,14,17,20,23,26,29,32-undecone 30-Ethyl-33-(1-hydroxy-2-methyl-hex-4-enyl)-6,9,18,24-tetraisobutyl-3,21-diisopropyl-1,4,7,10,12,15,19,25,28-nonamethyl-1,4,7,10,13,16,19,22,25,28,31undecaaza-cyclotritriacontan-2,5,8,11,14,17,20,23,26,29,32-undecaone Cyclosporin A Cyclosproine A US9138393, Cyclosporin A
TypeSmall organic molecule
Emp. Form.C62H111N11O12
Mol. Mass.1202.6112
SMILESCC[C@@H]1NC(=O)[C@H]([C@H](O)[C@H](C)C\C=C\C)N(C)C(=O)[C@H](C(C)C)N(C)C(=O)[C@H](CC(C)C)N(C)C(=O)[C@H](CC(C)C)N(C)C(=O)[C@@H](C)NC(=O)[C@H](C)NC(=O)[C@H](CC(C)C)N(C)C(=O)[C@@H](NC(=O)[C@H](CC(C)C)N(C)C(=O)CN(C)C1=O)C(C)C