Reaction Details
TargetCarbonic anhydrase 1
LigandBDBM50028970
Substrate/Competitorn/a
Meas. Tech.CA Activity Assay
pH7.4±0
Temperature298.15±0 K
Ki 4.51e+4±n/a nM
Citation Sentürk, MEkinci, DGöksu, SSupuran, CT Effects of dopaminergic compounds on carbonic anhydrase isozymes I, II, and VI. J Enzyme Inhib Med Chem27:365-9 (2012) 
 
Carbonic anhydrase 1
Name:Carbonic anhydrase 1
Type:Enzyme
Mol. Mass.:28873.37
Organism:Homo sapiens (Human)
Description:P00915
Residue:261
BDBM50028970
NameBDBM50028970
Synonyms:6-Amino-5,6,7,8-tetrahydro-naphthalene-1,2-diol CHEMBL163912
TypeSmall organic molecule
Emp. Form.C10H13NO2
Mol. Mass.179.2157
SMILESNC1CCc2c(C1)ccc(O)c2O