Reaction Details
TargetCarbonic anhydrase 1
LigandBDBM236510
Substrate/Competitorn/a
Meas. Tech.CA Activity Assay
pH7.4±0
Temperature298.15±0 K
Ki 3.63e+5±n/a nM
Citation Sentürk, MEkinci, DGöksu, SSupuran, CT Effects of dopaminergic compounds on carbonic anhydrase isozymes I, II, and VI. J Enzyme Inhib Med Chem27:365-9 (2012) 
 
Carbonic anhydrase 1
Name:Carbonic anhydrase 1
Type:Enzyme
Mol. Mass.:28873.37
Organism:Homo sapiens (Human)
Description:P00915
Residue:261
BDBM236510
NameBDBM236510
Synonyms:CA inhibitor, 5
TypeSmall organic molecule
Emp. Form.C9H9Br2N
Mol. Mass.290.982
SMILESNC1Cc2cc(Br)c(Br)cc2C1