Reaction Details
TargetGag-Pol polyprotein [489-587,Q496K]
LigandBDBM293266
Substrate/Competitorn/a
Meas. Tech.Inhibition of HIV Replication
pH7.55±n/a
EC50 550±n/a nM
Commentsextracted
Citation Kadow, JFNaidu, BNTu, Y Pyridin-3-yl acetic acid derivatives as inhibitors of human immunodeficiency virus replication US Patent US10106504 Publication Date 10/23/2018
 
Gag-Pol polyprotein [489-587,Q496K]
Name:Gag-Pol polyprotein [489-587,Q496K]
Type:Enzyme Subunit
Mol. Mass.:10823.26
Organism:Human immunodeficiency virus type 1
Description:P12497[489-587,Q496K]
Residue:99
BDBM293266
NameBDBM293266
Synonyms:US10106504, Example 3
TypeSmall organic molecule
Emp. Form.C34H37NO5
Mol. Mass.539.6613
SMILESCOc1ccc(COc2ccc(cc2)-c2c(C)nc(C)c([C@H](OC(C)(C)C)C(O)=O)c2-c2ccc(C)cc2)cc1