Reaction Details
TargetGag-Pol polyprotein [489-587,Q496K]
LigandBDBM293324
Substrate/Competitorn/a
Meas. Tech.Inhibition of HIV Replication
pH7.55±n/a
EC50<100±n/a nM
Commentsextracted
Citation Kadow, JFNaidu, BNTu, Y Pyridin-3-yl acetic acid derivatives as inhibitors of human immunodeficiency virus replication US Patent US10106504 Publication Date 10/23/2018
 
Gag-Pol polyprotein [489-587,Q496K]
Name:Gag-Pol polyprotein [489-587,Q496K]
Type:Enzyme Subunit
Mol. Mass.:10823.26
Organism:Human immunodeficiency virus type 1
Description:P12497[489-587,Q496K]
Residue:99
BDBM293324
NameBDBM293324
Synonyms:US10106504, Example 61
TypeSmall organic molecule
Emp. Form.C38H42FN3O4
Mol. Mass.623.7562
SMILESCc1nc(N)c(-c2ccc3CN(Cc4cccc(F)c4C)CCc3c2)c(-c2ccc3OCCCc3c2)c1[C@H](OC(C)(C)C)C(O)=O