Reaction Details
TargetVascular endothelial growth factor receptor 2
LigandBDBM139602
Substrate/Competitorn/a
Meas. Tech.VEGFR2 Kinase Assay
pH7.4±n/a
Temperature303.15±n/a K
IC50 27±n/a nM
Commentsextracted
Citation Hull, III, CEMalone, TC Method of treating conditiions with kinase inhibitors US Patent US9388176 Publication Date 7/12/2016
 
Vascular endothelial growth factor receptor 2
Name:Vascular endothelial growth factor receptor 2
Type:Receptor Tyrosine Kinase
Mol. Mass.:151510.97
Organism:Homo sapiens (Human)
Description:P35968
Residue:1356
BDBM139602
NameBDBM139602
Synonyms:US8889870, 148 US9820989, 148
TypeSmall organic molecule
Emp. Form.C22H20F3N5O
Mol. Mass.427.4223
SMILESCc1cc(cc(c1)C(=O)Nc1cccc(c1)C(F)(F)F)N1CCc2nc(N)ncc2C1