Reaction Details
TargetCarbonic anhydrase 1
LigandBDBM12414
Substrate/CompetitorBDBM237235
Meas. Tech.CA Activity Assay
pH7.4±0
Temperature298.15±0 K
Ki 3.996e+4±n/a nM
Citation Ekinci, DAl-Rashida, MAbbas, GSentürk, MSupuran, CT Chromone containing sulfonamides as potent carbonic anhydrase inhibitors. J Enzyme Inhib Med Chem27:744-7 (2012) 
 
Carbonic anhydrase 1
Name:Carbonic anhydrase 1
Type:Enzyme
Mol. Mass.:28873.37
Organism:Homo sapiens (Human)
Description:P00915
Residue:261
BDBM12414
BDBM237235
NameBDBM12414
Synonyms:CHEMBL27601 hCA inhibitor, 6
TypeSmall organic molecule
Emp. Form.C6H7NO2S
Mol. Mass.157.19
SMILESNS(=O)(=O)c1ccccc1