Reaction Details
TargetCarbonic anhydrase 2
LigandBDBM12414
Substrate/CompetitorBDBM237235
Meas. Tech.CA Activity Assay
pH7.4±0
Temperature298.15±0 K
Ki 1103±n/a nM
Citation Ekinci, DAl-Rashida, MAbbas, GSentürk, MSupuran, CT Chromone containing sulfonamides as potent carbonic anhydrase inhibitors. J Enzyme Inhib Med Chem27:744-7 (2012) 
 
Carbonic anhydrase 2
Name:Carbonic anhydrase 2
Type:Enzyme
Mol. Mass.:29250.71
Organism:Homo sapiens (Human)
Description:P00918
Residue:260
BDBM12414
BDBM237235
NameBDBM12414
Synonyms:CHEMBL27601 hCA inhibitor, 6
TypeSmall organic molecule
Emp. Form.C6H7NO2S
Mol. Mass.157.19
SMILESNS(=O)(=O)c1ccccc1