Reaction Details
TargetCarbonic anhydrase 6
LigandBDBM237231
Substrate/CompetitorBDBM237235
Meas. Tech.CA Activity Assay
pH7.4±0
Temperature298.15±0 K
Ki 943±n/a nM
Citation Ekinci, DAl-Rashida, MAbbas, GSentürk, MSupuran, CT Chromone containing sulfonamides as potent carbonic anhydrase inhibitors. J Enzyme Inhib Med Chem27:744-7 (2012) 
 
Carbonic anhydrase 6
Name:Carbonic anhydrase 6
Type:Enzyme
Mol. Mass.:35371.40
Organism:Homo sapiens (Human)
Description:P23280
Residue:308
BDBM237231
BDBM237235
NameBDBM237231
Synonyms:hCA inhibitor, 1
TypeSmall organic molecule
Emp. Form.C18H18N2O5S
Mol. Mass.374.411
SMILESCCOC1Oc2ccccc2C(=O)\C1=C/Nc1ccc(cc1)S(N)(=O)=O