Reaction Details
TargetCarbonic anhydrase 2
LigandBDBM10857
Substrate/Competitorn/a
Meas. Tech.Esterase Activity Assay
pH7.4±n/a
Ki 23± 4.5 nM
Commentsextracted
Citation Ayvaz, SÇankaya, MAtasever, AAltuntas, A 2-Amino-3-cyanopyridine derivatives as carbonic anhydrase inhibitors. J Enzyme Inhib Med Chem28:305-10 (2013) 
 
Carbonic anhydrase 2
Name:Carbonic anhydrase 2
Type:Enzyme
Mol. Mass.:29250.71
Organism:Homo sapiens (Human)
Description:P00918
Residue:260
BDBM10857
NameBDBM10857
Synonyms:4-aminobenzene-1-sulfonamide Sulfanilamide aromatic/heteroaromatic sulfonamide 2 | halogenosulfanilamide deriv. 5a
TypeSmall organic molecule
Emp. Form.C6H8N2O2S
Mol. Mass.172.205
SMILESNc1ccc(cc1)S(N)(=O)=O