Reaction Details
TargetCarbonic anhydrase 6
LigandBDBM60970
Substrate/Competitorn/a
Meas. Tech.CA Inhibition Assay
pH7.5±n/a
Temperature298.15±n/a K
Ki 50±n/a nM
Commentsextracted
Citation Özdemir, ZÿSentürk, MEkinci, D Inhibition of mammalian carbonic anhydrase isoforms I, II and VI with thiamine and thiamine-like molecules. J Enzyme Inhib Med Chem28:316-9 (2013) 
 
Carbonic anhydrase 6
Name:Carbonic anhydrase 6
Type:Enzyme
Mol. Mass.:35371.40
Organism:Homo sapiens (Human)
Description:P23280
Residue:308
BDBM60970
NameBDBM60970
Synonyms:Ethoxzolamide (EZA)
Typen/a
Emp. Form.C11H14N2O3S2
Mol. Mass.286.37
SMILESCCOc1ccc2N=CC(CS(N)(=O)=O)Sc2c1