Reaction Details
TargetCarbonic anhydrase 2
LigandBDBM237299
Substrate/Competitor4-Nitrophenyl acetate (NPA)
Meas. Tech.Esterase Activity Assay
Ki 3.2e+2±n/a nM
Citation Kazancioglu, EAGüney, MSentürk, MSupuran, CT Simple methanesulfonates are hydrolyzed by the sulfatase carbonic anhydrase activity. J Enzyme Inhib Med Chem27:880-5 (2012) 
 
Carbonic anhydrase 2
Name:Carbonic anhydrase 2
Type:Enzyme
Mol. Mass.:29250.71
Organism:Homo sapiens (Human)
Description:P00918
Residue:260
BDBM237299
4-Nitrophenyl acetate (NPA)
NameBDBM237299
Synonyms:Ethoxzolamide (EZA)
TypeSmall organic molecule
Emp. Form.C10H12N2O3S2
Mol. Mass.272.344
SMILESCCOc1ccc2nc(CS(N)(=O)=O)sc2c1