Reaction Details
TargetCarbonic anhydrase 2
LigandBDBM10859
Substrate/Competitorn/a
Meas. Tech.Esterase Activity Assay
IC50 715±n/a nM
Citation Alp, CÖzsoy, Å¿Alp, NAErdem, DGültekin, MSKüfrevioglu, Ã¿Ä°Sentürk, MSupuran, CT Sulfapyridine-like benzenesulfonamide derivatives as inhibitors of carbonic anhydrase isoenzymes I, II and VI. J Enzyme Inhib Med Chem27:818-24 (2012) 
 
Carbonic anhydrase 2
Name:Carbonic anhydrase 2
Type:Enzyme
Mol. Mass.:29250.71
Organism:Homo sapiens (Human)
Description:P00918
Residue:260
BDBM10859
NameBDBM10859
Synonyms:4-methylbenzene-1-sulfonamide aromatic/heteroaromatic sulfonamide 4 | hCA inhibitor, 7
TypeSmall organic molecule
Emp. Form.C7H9NO2S
Mol. Mass.171.217
SMILESCc1ccc(cc1)S(N)(=O)=O