Reaction Details
TargetCarbonic anhydrase 6
LigandBDBM237281
Substrate/Competitorn/a
Meas. Tech.Esterase Activity Assay
IC50 24280±n/a nM
Citation Alp, CÖzsoy, Å¿Alp, NAErdem, DGültekin, MSKüfrevioglu, Ã¿Ä°Sentürk, MSupuran, CT Sulfapyridine-like benzenesulfonamide derivatives as inhibitors of carbonic anhydrase isoenzymes I, II and VI. J Enzyme Inhib Med Chem27:818-24 (2012) 
 
Carbonic anhydrase 6
Name:Carbonic anhydrase 6
Type:Enzyme
Mol. Mass.:35371.40
Organism:Homo sapiens (Human)
Description:P23280
Residue:308
BDBM237281
NameBDBM237281
Synonyms:Carbonic anhydrase inhibitors (CAIs), 1
TypeSmall organic molecule
Emp. Form.C14H15NO2S
Mol. Mass.261.339
SMILESCc1ccc(NS(=O)(=O)c2ccc(C)cc2)cc1