Reaction Details
TargetCoagulation factor XI
LigandBDBM238261
Substrate/Competitorn/a
Meas. Tech.In Vitro Assay
IC50 6.5±n/a nM
Citation Imagawa, AKondo, TNishiyama, TCourtney, SYarnold, CIchihara, OFlanagan, S Substituted pyrrolidines as factor xia inhibitors for the treatment thromboembolic diseases US Patent US9394250 Publication Date 7/19/2016
 
Coagulation factor XI
Name:Coagulation factor XI
Type:Enzyme
Mol. Mass.:70130.58
Organism:Homo sapiens (Human)
Description:P03951
Residue:625
BDBM238261
NameBDBM238261
Synonyms:US10336741, Example 79 US9394250, 79 | US9585881, Example 79
TypeSmall organic molecule
Emp. Form.C29H35ClN8O5S
Mol. Mass.643.157
SMILESCOC(=O)Nc1ccc(cc1)-c1[nH]c(nc1Cl)[C@@H]1C[C@@H](CN1C(=O)c1ccc(NC(N)=N)cc1)C1CCN(CC1)S(C)(=O)=O