Reaction Details
TargetCoagulation factor XI
LigandBDBM238267
Substrate/Competitorn/a
Meas. Tech.In Vitro Assay
IC50 1.2±n/a nM
Citation Imagawa, AKondo, TNishiyama, TCourtney, SYarnold, CIchihara, OFlanagan, S Substituted pyrrolidines as factor xia inhibitors for the treatment thromboembolic diseases US Patent US9394250 Publication Date 7/19/2016
 
Coagulation factor XI
Name:Coagulation factor XI
Type:Enzyme
Mol. Mass.:70130.58
Organism:Homo sapiens (Human)
Description:P03951
Residue:625
BDBM238267
NameBDBM238267
Synonyms:US9394250, 99
TypeSmall organic molecule
Emp. Form.C28H39ClN8O5S
Mol. Mass.635.178
SMILESCOC(=O)Nc1ccc(cc1)-c1[nH]c(nc1Cl)[C@@H]1C[C@@H](CN1C(=O)C1CCC(CC1)C(N)=N)N1CCN(CC1)S(C)(=O)=O