Reaction Details
TargetProthrombin
LigandBDBM238268
Substrate/Competitorn/a
Meas. Tech.In Vitro Assay
IC50>100000±n/a nM
Citation Imagawa, AKondo, TNishiyama, TCourtney, SYarnold, CIchihara, OFlanagan, S Substituted pyrrolidines as factor xia inhibitors for the treatment thromboembolic diseases US Patent US9394250 Publication Date 7/19/2016
 
Prothrombin
Name:Prothrombin
Type:Protein
Mol. Mass.:70029.57
Organism:Homo sapiens (Human)
Description:P00734
Residue:622
BDBM238268
NameBDBM238268
Synonyms:US10336741, Example 98 US9394250, 98 | US9585881, Example 98
TypeSmall organic molecule
Emp. Form.C27H39N9O5S
Mol. Mass.601.721
SMILESCOC(=O)Nc1ccc(cc1)-c1cnc([nH]1)[C@@H]1C[C@@H](CN1C(=O)C1CCN(CC1)C(N)=N)N1CCN(CC1)S(C)(=O)=O