Reaction Details
TargetProthrombin
LigandBDBM238259
Substrate/Competitorn/a
Meas. Tech.In Vitro Assay
IC50 94000±n/a nM
Citation Imagawa, AKondo, TNishiyama, TCourtney, SYarnold, CIchihara, OFlanagan, S Substituted pyrrolidines as factor xia inhibitors for the treatment thromboembolic diseases US Patent US9394250 Publication Date 7/19/2016
 
Prothrombin
Name:Prothrombin
Type:Protein
Mol. Mass.:70029.57
Organism:Homo sapiens (Human)
Description:P00734
Residue:622
BDBM238259
NameBDBM238259
Synonyms:US10336741, Example 71 US9394250, 71 | US9585881, Example 71
TypeSmall organic molecule
Emp. Form.C28H39ClN8O5S
Mol. Mass.635.178
SMILESCOC(=O)Nc1ccc(cc1)-c1[nH]c(nc1Cl)[C@@H]1C[C@@H](CN1C(=O)C1CCN(CC1)C(N)=N)C1CCN(CC1)S(C)(=O)=O