Reaction Details
TargetProthrombin
LigandBDBM238267
Substrate/Competitorn/a
Meas. Tech.In Vitro Assay
IC50 84000±n/a nM
Citation Imagawa, AKondo, TNishiyama, TCourtney, SYarnold, CIchihara, OFlanagan, S Substituted pyrrolidines as factor xia inhibitors for the treatment thromboembolic diseases US Patent US9394250 Publication Date 7/19/2016
 
Prothrombin
Name:Prothrombin
Type:Protein
Mol. Mass.:70029.57
Organism:Homo sapiens (Human)
Description:P00734
Residue:622
BDBM238267
NameBDBM238267
Synonyms:US9394250, 99
TypeSmall organic molecule
Emp. Form.C28H39ClN8O5S
Mol. Mass.635.178
SMILESCOC(=O)Nc1ccc(cc1)-c1[nH]c(nc1Cl)[C@@H]1C[C@@H](CN1C(=O)C1CCC(CC1)C(N)=N)N1CCN(CC1)S(C)(=O)=O