Reaction Details
TargetCoagulation factor X
LigandBDBM238265
Substrate/Competitorn/a
Meas. Tech.In Vitro Assay
IC50>33000±n/a nM
Citation Imagawa, AKondo, TNishiyama, TCourtney, SYarnold, CIchihara, OFlanagan, S Substituted pyrrolidines as factor xia inhibitors for the treatment thromboembolic diseases US Patent US9394250 Publication Date 7/19/2016
 
Coagulation factor X
Name:Coagulation factor X
Type:Enzyme
Mol. Mass.:54726.60
Organism:Homo sapiens (Human)
Description:n/a
Residue:488
BDBM238265
NameBDBM238265
Synonyms:US10336741, Example 94 US9394250, 94 | US9585881, Example 94
TypeSmall organic molecule
Emp. Form.C31H33Cl2N9O5S
Mol. Mass.714.622
SMILESCOC(=O)Nc1ccc(cc1)-c1[nH]c(nc1Cl)[C@@H]1C[C@@H](CN1C(=O)\C=C\c1cc(Cl)ccc1-n1cnnn1)C1CCN(CC1)S(C)(=O)=O