Reaction Details
TargetTyrosine-protein kinase JAK1
LigandBDBM237866
Substrate/Competitorn/a
Meas. Tech.Biochemical HTRF Assay
IC50 0.2±n/a nM
Citation Brubaker, JClose, JSiu, TSmith, GFTorres, LEWoo, HCYoung, JRWei, ZShi, F Pyrazole carboxamides as Janus kinase inhibitors US Patent US9394282 Publication Date 7/19/2016
 
Tyrosine-protein kinase JAK1
Name:Tyrosine-protein kinase JAK1
Type:Protein
Mol. Mass.:133293.73
Organism:Homo sapiens (Human)
Description:P23458
Residue:1154
BDBM237866
NameBDBM237866
Synonyms:US9394282, 9-1
TypeSmall organic molecule
Emp. Form.C15H15FN6O2
Mol. Mass.330.317
SMILESNC(=O)c1cn(nc1Nc1ccnc(F)c1)[C@H]1COCC[C@@H]1C#N