Reaction Details
TargetTyrosine-protein kinase JAK2
LigandBDBM237866
Substrate/Competitorn/a
Meas. Tech.Biochemical HTRF Assay
IC50 2±n/a nM
Citation Brubaker, JClose, JSiu, TSmith, GFTorres, LEWoo, HCYoung, JRWei, ZShi, F Pyrazole carboxamides as Janus kinase inhibitors US Patent US9394282 Publication Date 7/19/2016
 
Tyrosine-protein kinase JAK2
Name:Tyrosine-protein kinase JAK2
Type:Protein
Mol. Mass.:130684.68
Organism:Homo sapiens (Human)
Description:O60674
Residue:1132
BDBM237866
NameBDBM237866
Synonyms:US9394282, 9-1
TypeSmall organic molecule
Emp. Form.C15H15FN6O2
Mol. Mass.330.317
SMILESNC(=O)c1cn(nc1Nc1ccnc(F)c1)[C@H]1COCC[C@@H]1C#N