Reaction Details
TargetCarbonic anhydrase 2
LigandBDBM238298
Substrate/Competitorn/a
Meas. Tech.CA Activity Assay
pH7.4±0
Temperature298.15±0 K
Ki 55±n/a nM
Citation Sen, EAlim, ZDuran, HIsgör, MMBeydemir, Å¿Kasimogullari, ROk, S Inhibitory effect of novel pyrazole carboxamide derivatives on human carbonic anhydrase enzyme. J Enzyme Inhib Med Chem28:328-36 (2013) 
 
Carbonic anhydrase 2
Name:Carbonic anhydrase 2
Type:Enzyme
Mol. Mass.:29250.71
Organism:Homo sapiens (Human)
Description:P00918
Residue:260
BDBM238298
NameBDBM238298
Synonyms:1-(3-aminophenyl)-4-benzoyl-5-phenyl-N-(4-sulfamoylphenyl)-1H-pyrazole-3-carboxamide (3)
TypeSmall organic molecule
Emp. Form.C29H23N5O4S
Mol. Mass.537.589
SMILESNc1cccc(c1)-n1nc(C(=O)Nc2ccc(cc2)S(N)(=O)=O)c(C(=O)c2ccccc2)c1-c1ccccc1