Reaction Details
TargetLysine-specific demethylase 4C
LigandBDBM293691
Substrate/Competitorn/a
Meas. Tech.JMJD2C Assay
Temperature298.15±n/a K
IC50 5500±n/a nM
Commentsextracted
Citation Boloor, AChen, YKWallace, MB Histone demethylase inhibitors US Patent US10106534 Publication Date 10/23/2018
 
Lysine-specific demethylase 4C
Name:Lysine-specific demethylase 4C
Type:Protein
Mol. Mass.:119979.01
Organism:Homo sapiens (Human)
Description:Q9H3R0
Residue:1056
BDBM293691
NameBDBM293691
Synonyms:3-({[(4S)-7-(thiophen-3-yl)-3,4-dihydro-2H-1-benzopyran-4- | US10106534, Example 33
TypeSmall organic molecule
Emp. Form.C20H18N2O3S
Mol. Mass.366.434
SMILESOC(=O)c1ccncc1NC[C@H]1CCOc2cc(ccc12)-c1ccsc1