Reaction Details
TargetRho-associated protein kinase 1 [1-535]
LigandBDBM50382686
Substrate/Competitorn/a
Meas. Tech.FRET-Based Enzyme-Coupled Assay
pH7.5±n/a
Temperature298.15±n/a K
IC50 650±30 nM
Commentsextracted
Citation Schonbrunn, ELi, RSebti, SM Inhibitors of rho associated protein kinases (ROCK) and methods of use US Patent US9409868 Publication Date 8/9/2016
 
Rho-associated protein kinase 1 [1-535]
Name:Rho-associated protein kinase 1 [1-535]
Type:Enzyme
Mol. Mass.:62220.48
Organism:Homo sapiens (Human)
Description:aa 1-535
Residue:535
BDBM50382686
NameBDBM50382686
Synonyms:CHEMBL2023154 | US9409868, 18
TypeSmall organic molecule
Emp. Form.C16H16N4O
Mol. Mass.280.3244
SMILESO=C(NCCc1ccccc1)Nc1ccc2[nH]ncc2c1