Reaction Details
TargetRho-associated protein kinase 2 [1-552]
LigandBDBM50382702
Substrate/Competitorn/a
Meas. Tech.FRET-Based Enzyme-Coupled Assay
pH7.5±n/a
Temperature298.15±n/a K
IC50>4000000±n/a nM
Commentsextracted
Citation Schonbrunn, ELi, RSebti, SM Inhibitors of rho associated protein kinases (ROCK) and methods of use US Patent US9409868 Publication Date 8/9/2016
 
Rho-associated protein kinase 2 [1-552]
Name:Rho-associated protein kinase 2 [1-552]
Type:Enzyme
Mol. Mass.:63353.50
Organism:Homo sapiens (Human)
Description:aa 1-552
Residue:552
BDBM50382702
NameBDBM50382702
Synonyms:CHEMBL2023145 | US9409868, 7
TypeSmall organic molecule
Emp. Form.C17H12FN3O
Mol. Mass.293.2951
SMILESFc1ccc(cc1)-c1cncc(c1)C(=O)Nc1ccncc1