Reaction Details
TargetCarbonic anhydrase 7
LigandBDBM239155
Substrate/Competitorn/a
Meas. Tech.CA Inhibition Assay
pH7.5±n/a
Temperature277.15±n/a K
Ki 4.2e+2±n/a nM
Commentsextracted
Citation Bonneau, AMaresca, AWinum, JYSupuran, CT Metronidazole-coumarin conjugates and 3-cyano-7-hydroxy-coumarin act as isoform-selective carbonic anhydrase inhibitors. J Enzyme Inhib Med Chem28:397-401 (2013) 
 
Carbonic anhydrase 7
Name:Carbonic anhydrase 7
Type:Enzyme
Mol. Mass.:29664.11
Organism:Homo sapiens (Human)
Description:Human cloned isozyme.
Residue:264
BDBM239155
NameBDBM239155
Synonyms:7-O-[2-(2-methyl-5-nitro-imidazol-1-yl)ethyl]-4-methylcoumarine (1a)
TypeSmall organic molecule
Emp. Form.C16H15N3O5
Mol. Mass.329.3074
SMILESCc1ncc(n1CCOc1ccc2c(C)cc(=O)oc2c1)[N+]([O-])=O