Reaction Details
TargetCarbonic anhydrase 9
LigandBDBM239156
Substrate/Competitorn/a
Meas. Tech.CA Inhibition Assay
pH7.5±n/a
Temperature277.15±n/a K
Ki 4.0e+2±n/a nM
Commentsextracted
Citation Bonneau, AMaresca, AWinum, JYSupuran, CT Metronidazole-coumarin conjugates and 3-cyano-7-hydroxy-coumarin act as isoform-selective carbonic anhydrase inhibitors. J Enzyme Inhib Med Chem28:397-401 (2013) 
 
Carbonic anhydrase 9
Name:Carbonic anhydrase 9
Type:Enzyme
Mol. Mass.:49669.03
Organism:Homo sapiens (Human)
Description:Catalytic domain of human cloned isozyme was used in the assay
Residue:459
BDBM239156
NameBDBM239156
Synonyms:6-O-[2-(2-methyl-5-nitro-imidazol-1-yl)ethyl]-4-methylcoumarine (1b)
TypeSmall organic molecule
Emp. Form.C16H15N3O5
Mol. Mass.329.3074
SMILESCc1ncc(n1CCOc1ccc2oc(=O)cc(C)c2c1)[N+]([O-])=O