Reaction Details
TargetCarbonic anhydrase 9
LigandBDBM50095994
Substrate/Competitorn/a
Meas. Tech.CA Inhibition Assay
pH7.5±n/a
Temperature277.15±n/a K
Ki 2.4e+2±n/a nM
Commentsextracted
Citation Bonneau, AMaresca, AWinum, JYSupuran, CT Metronidazole-coumarin conjugates and 3-cyano-7-hydroxy-coumarin act as isoform-selective carbonic anhydrase inhibitors. J Enzyme Inhib Med Chem28:397-401 (2013) 
 
Carbonic anhydrase 9
Name:Carbonic anhydrase 9
Type:Enzyme
Mol. Mass.:49669.03
Organism:Homo sapiens (Human)
Description:Catalytic domain of human cloned isozyme was used in the assay
Residue:459
BDBM50095994
NameBDBM50095994
Synonyms:3-Cyano-7-hydroxycoumarin (2) CHEMBL150302
TypeSmall organic molecule
Emp. Form.C10H5NO3
Mol. Mass.187.1516
SMILESOc1ccc2cc(C#N)c(=O)oc2c1