Reaction Details
TargetCarbonic anhydrase 4
LigandBDBM23417
Substrate/Competitorn/a
Meas. Tech.Esterase Activity Assay
pH7.4±n/a
Ki 3.98e+3±n/a nM
Commentsextracted
Citation Koz, Ã¿Ekinci, DPerrone, APiacente, SAlankus-Çaliskan, Ã¿Bedir, ESupuran, CT Analysis of saponins and phenolic compounds as inhibitors of a-carbonic anhydrase isoenzymes. J Enzyme Inhib Med Chem28:412-7 (2013) 
 
Carbonic anhydrase 4
Name:Carbonic anhydrase 4
Type:Enzyme
Mol. Mass.:35037.98
Organism:Homo sapiens (Human)
Description:P22748
Residue:312
BDBM23417
NameBDBM23417
Synonyms:α-CA inhibitor, 4 (2R,3R)-2-(3,4-dihydroxyphenyl)-3,4-dihydro-2H-1-benzopyran-3,5,7-triol L-Epicatechin | cid_72276
TypeFlavonol
Emp. Form.C15H14O6
Mol. Mass.290.2681
SMILESO[C@@H]1Cc2c(O)cc(O)cc2O[C@@H]1c1ccc(O)c(O)c1