Reaction Details
TargetCarbonic anhydrase 4
LigandBDBM239159
Substrate/Competitorn/a
Meas. Tech.Esterase Activity Assay
pH7.4±n/a
Ki 2.41e+3±n/a nM
Commentsextracted
Citation Koz, Ã¿Ekinci, DPerrone, APiacente, SAlankus-Çaliskan, Ã¿Bedir, ESupuran, CT Analysis of saponins and phenolic compounds as inhibitors of a-carbonic anhydrase isoenzymes. J Enzyme Inhib Med Chem28:412-7 (2013) 
 
Carbonic anhydrase 4
Name:Carbonic anhydrase 4
Type:Enzyme
Mol. Mass.:35037.98
Organism:Homo sapiens (Human)
Description:P22748
Residue:312
BDBM239159
NameBDBM239159
Synonyms:α-CA inhibitor, 7
TypeSmall organic molecule
Emp. Form.C46H76O18
Mol. Mass.917.0848
SMILESCC(C)(O)[C@@H]1CC[C@@](C)(O1)[C@H]1[C@@H](O)C[C@@]2(C)C3C[C@H](O[C@@H]4OC(CO)[C@@H](O)C(O)[C@@H]4O)C4[C@]5(C[C@@]35CC[C@]12C)CC[C@H](O[C@@H]1OC[C@@H](O)C(O)[C@@H]1O[C@@H]1OC[C@H](O)C(O)[C@@H]1O)C4(C)C