Reaction Details
TargetCalpain-1 catalytic subunit
LigandBDBM240232
Substrate/Competitorn/a
Meas. Tech.Inhibition Kinetics Assay
pH7.6±n/a
Temperature303.15±n/a K
Ki 4000±n/a nM
Commentsextracted
Citation Thatcher, GRSchiefer, ITArancio, OMauro, F Cysteine protease inhibitors and uses thereof US Patent US9403843 Publication Date 8/2/2016
 
Calpain-1 catalytic subunit
Name:Calpain-1 catalytic subunit
Type:Catalytic subunit; forms a heterodimer with a small (regulatory) subunit (CAPNS1)
Mol. Mass.:81729.82
Organism:Sus scrofa (pig)
Description:Native calpain-1 from porcine erythrocytes, purchased from Calbiochem, was used in assay.
Residue:714
BDBM240232
NameBDBM240232
Synonyms:US9403843, E64
TypeSmall organic molecule
Emp. Form.C15H27N5O5
Mol. Mass.357.4054
SMILESCC(C)C[C@H](NC(=O)C1O[C@@H]1C(O)=O)C(=O)NCCCCNC(N)=N