Reaction Details
TargetCalpain-1 catalytic subunit
LigandBDBM50437951
Substrate/Competitorn/a
Meas. Tech.Inhibition Kinetics Assay
pH7.6±n/a
Temperature303.15±n/a K
Ki 6000±n/a nM
Commentsextracted
Citation Thatcher, GRSchiefer, ITArancio, OMauro, F Cysteine protease inhibitors and uses thereof US Patent US9403843 Publication Date 8/2/2016
 
Calpain-1 catalytic subunit
Name:Calpain-1 catalytic subunit
Type:Catalytic subunit; forms a heterodimer with a small (regulatory) subunit (CAPNS1)
Mol. Mass.:81729.82
Organism:Sus scrofa (pig)
Description:Native calpain-1 from porcine erythrocytes, purchased from Calbiochem, was used in assay.
Residue:714
BDBM50437951
NameBDBM50437951
Synonyms:CHEMBL2408922 | US9403843, 24a
TypeSmall organic molecule
Emp. Form.C19H20FN3O5S
Mol. Mass.421.443
SMILESCC(C)C[C@H](NC(=O)[C@H]1O[C@@H]1C(O)=O)C(=O)Nc1nc(cs1)-c1ccc(F)cc1