Reaction Details
TargetCalpain-1 catalytic subunit
LigandBDBM50437949
Substrate/Competitorn/a
Meas. Tech.Inhibition Kinetics Assay
pH7.6±n/a
Temperature303.15±n/a K
Ki 3500±n/a nM
Commentsextracted
Citation Thatcher, GRSchiefer, ITArancio, OMauro, F Cysteine protease inhibitors and uses thereof US Patent US9403843 Publication Date 8/2/2016
 
Calpain-1 catalytic subunit
Name:Calpain-1 catalytic subunit
Type:Catalytic subunit; forms a heterodimer with a small (regulatory) subunit (CAPNS1)
Mol. Mass.:81729.82
Organism:Sus scrofa (pig)
Description:Native calpain-1 from porcine erythrocytes, purchased from Calbiochem, was used in assay.
Residue:714
BDBM50437949
NameBDBM50437949
Synonyms:CHEMBL2408918 | US9403843, 34
TypeSmall organic molecule
Emp. Form.C21H16N4O5S2
Mol. Mass.468.506
SMILESOC(=O)[C@H]1O[C@@H]1C(=O)N[C@@H](Cc1cscn1)C(=O)Nc1nc(cs1)-c1ccc(cc1)C#C