Reaction Details
TargetProtein O-GlcNAcase
LigandBDBM240645
Substrate/CompetitorBDBM240663
Meas. Tech.Fluorescence-Based Assay
pH7±n/a
Temperature298.15±n/a K
Ki 0.3±n/a nM
Commentsextracted
Citation Li, TMcEachern, EVocadlo, DZhou, YZhu, YSelnick, H Selective glycosidase inhibitors and uses thereof US Patent US9409924 Publication Date 8/9/2016
 
Protein O-GlcNAcase
Name:Protein O-GlcNAcase
Type:Enzyme
Mol. Mass.:102874.67
Organism:Homo sapiens (Human)
Description:O60502
Residue:916
BDBM240645
BDBM240663
NameBDBM240645
Synonyms:US9409924, (3aR,5R,6R,7S,7aR)-2-(dimethylamino)-7-fluoro-5-(hydroxymethyl)-3aH,5H,6H,7H,7aH-pyrano[3,2-d][1,3]thiazol-6-ol
TypeSmall organic molecule
Emp. Form.C9H15FN2O3S
Mol. Mass.250.29
SMILESCN(C)C1=N[C@H]2[C@H](O[C@H](CO)[C@@H](O)[C@H]2F)S1