Reaction Details
TargetFatty acid synthase
LigandBDBM50009248
Substrate/Competitorn/a
Meas. Tech.FAS Inhibitory Assay
pH7±0
Temperature310.15±0 K
IC50 1.30e+4± 9e+2 nM
Citation Oh, JHwang, IHHong, CELyu, SYNa, M Inhibition of fatty acid synthase by ginkgolic acids from the leaves of Ginkgo biloba and their cytotoxic activity. J Enzyme Inhib Med Chem28:565-8 (2013) 
 
Fatty acid synthase
Name:Fatty acid synthase
Type:Enzyme
Mol. Mass.:274770.36
Organism:Gallus gallus (Chicken)
Description:P12276
Residue:2512
BDBM50009248
NameBDBM50009248
Synonyms:(2R,3S)-3-((4E,7E)-Nona-4,7-dienoyl)-oxirane-2-carboxylic acid amide 3-Nona-4,7-dienoyl-oxirane-2-carboxylic acid amide CERULENIN | CHEMBL45627
TypeSmall organic molecule
Emp. Form.C12H17NO3
Mol. Mass.223.2683
SMILESC\C=C\C\C=C\CCC(=O)[C@H]1O[C@H]1C(N)=O