Reaction Details
TargetCoagulation factor IX
LigandBDBM241422
Substrate/CompetitorUS9409908, pyroGlu-Pro-Arg-pNA
Meas. Tech.In Vitro Assay
pH7.4±n/a
Ki 0.08±n/a nM
Commentsextracted
Citation Yang, WCorte, JRGilligan, PJPinto, DJEwing, WRDilger, AKWang, YFang, TPabbisetty, KBSmith, II, LM Dihydropyridone p1 as factor XIa inhibitors US Patent US9409908 Publication Date 8/9/2016
 
Coagulation factor IX
Name:Coagulation factor IX
Type:Enzyme
Mol. Mass.:51768.83
Organism:Homo sapiens (Human)
Description:P00740
Residue:461
BDBM241422
US9409908, pyroGlu-Pro-Arg-pNA
NameBDBM241422
Synonyms:US9409908, 54 | US9951071, Example 54
TypeSmall organic molecule
Emp. Form.C32H31ClF2N4O5
Mol. Mass.625.062
SMILESC[C@@H]1CCC[C@H](N2CCC(=CC2=O)c2c(F)ccc(Cl)c2F)c2cc(ccn2)-c2ccc(NC(=O)OCCO)cc2NC1=O