Reaction Details
TargetCoagulation factor IX
LigandBDBM241459
Substrate/CompetitorUS9409908, pyroGlu-Pro-Arg-pNA
Meas. Tech.In Vitro Assay
pH7.4±n/a
Ki 0.56±n/a nM
Commentsextracted
Citation Yang, WCorte, JRGilligan, PJPinto, DJEwing, WRDilger, AKWang, YFang, TPabbisetty, KBSmith, II, LM Dihydropyridone p1 as factor XIa inhibitors US Patent US9409908 Publication Date 8/9/2016
 
Coagulation factor IX
Name:Coagulation factor IX
Type:Enzyme
Mol. Mass.:51768.83
Organism:Homo sapiens (Human)
Description:P00740
Residue:461
BDBM241459
US9409908, pyroGlu-Pro-Arg-pNA
NameBDBM241459
Synonyms:US9409908, 91 | US9951071, Example 91
TypeSmall organic molecule
Emp. Form.C29H25ClF2N4O2
Mol. Mass.534.984
SMILESC[C@@H]1CCC[C@@H](c2cc(ccn2)-c2ccc(N)cc2NC1=O)n1ccc(cc1=O)-c1c(F)ccc(Cl)c1F