Reaction Details
TargetCoagulation factor IX
LigandBDBM241535
Substrate/CompetitorUS9409908, pyroGlu-Pro-Arg-pNA
Meas. Tech.In Vitro Assay
pH7.4±n/a
Ki 0.81±n/a nM
Commentsextracted
Citation Yang, WCorte, JRGilligan, PJPinto, DJEwing, WRDilger, AKWang, YFang, TPabbisetty, KBSmith, II, LM Dihydropyridone p1 as factor XIa inhibitors US Patent US9409908 Publication Date 8/9/2016
 
Coagulation factor IX
Name:Coagulation factor IX
Type:Enzyme
Mol. Mass.:51768.83
Organism:Homo sapiens (Human)
Description:P00740
Residue:461
BDBM241535
US9409908, pyroGlu-Pro-Arg-pNA
NameBDBM241535
Synonyms:US9409908, 167 | US9951071, Example 167
TypeSmall organic molecule
Emp. Form.C31H27BrClFN2O4
Mol. Mass.625.912
SMILESC[C@@H]1CCC[C@H](N2CCC(=CC2=O)c2c(F)c(Cl)ccc2Br)c2cccc(c2)-c2cc(ccc2NC1=O)C(O)=O