Reaction Details
TargetPlasma kallikrein
LigandBDBM241384
Substrate/CompetitorBDBM241595
Meas. Tech.In Vitro Assay
Temperature298.15±n/a K
Ki 1±n/a nM
Citation Yang, WCorte, JRGilligan, PJPinto, DJEwing, WRDilger, AKWang, YFang, TPabbisetty, KBSmith, II, LM Dihydropyridone p1 as factor XIa inhibitors US Patent US9409908 Publication Date 8/9/2016
 
Plasma kallikrein
Name:Plasma kallikrein
Type:Protein
Mol. Mass.:71391.16
Organism:Homo sapiens (Human)
Description:P03952
Residue:638
BDBM241384
BDBM241595
NameBDBM241384
Synonyms:US9409908, 16 | US9951071, Example 16
TypeSmall organic molecule
Emp. Form.C33H29ClF2N6O2
Mol. Mass.615.072
SMILESC[C@@H]1CCC[C@H](N2CCC(=CC2=O)c2c(F)ccc(Cl)c2F)c2cc(ccn2)-c2ccc(Nc3ncccn3)cc2NC1=O