Reaction Details
TargetPlasma kallikrein
LigandBDBM241400
Substrate/CompetitorBDBM241595
Meas. Tech.In Vitro Assay
Temperature298.15±n/a K
Ki 6±n/a nM
Citation Yang, WCorte, JRGilligan, PJPinto, DJEwing, WRDilger, AKWang, YFang, TPabbisetty, KBSmith, II, LM Dihydropyridone p1 as factor XIa inhibitors US Patent US9409908 Publication Date 8/9/2016
 
Plasma kallikrein
Name:Plasma kallikrein
Type:Protein
Mol. Mass.:71391.16
Organism:Homo sapiens (Human)
Description:P03952
Residue:638
BDBM241400
BDBM241595
NameBDBM241400
Synonyms:US9409908, 32 | US9951071, Example 32
TypeSmall organic molecule
Emp. Form.C32H30ClF3N4O5
Mol. Mass.643.053
SMILESCOC(=O)Nc1ccc-2c(NC(=O)[C@H](C)CCC[C@H](N3CCC(=CC3=O)c3c(F)c(Cl)ccc3OC(F)F)c3cc-2ccn3)c1