Reaction Details
TargetPlasma kallikrein
LigandBDBM241459
Substrate/CompetitorBDBM241595
Meas. Tech.In Vitro Assay
Temperature310.15±n/a K
Ki 3±n/a nM
Citation Yang, WCorte, JRGilligan, PJPinto, DJEwing, WRDilger, AKWang, YFang, TPabbisetty, KBSmith, II, LM Dihydropyridone p1 as factor XIa inhibitors US Patent US9409908 Publication Date 8/9/2016
 
Plasma kallikrein
Name:Plasma kallikrein
Type:Protein
Mol. Mass.:71391.16
Organism:Homo sapiens (Human)
Description:P03952
Residue:638
BDBM241459
BDBM241595
NameBDBM241459
Synonyms:US9409908, 91 | US9951071, Example 91
TypeSmall organic molecule
Emp. Form.C29H25ClF2N4O2
Mol. Mass.534.984
SMILESC[C@@H]1CCC[C@@H](c2cc(ccn2)-c2ccc(N)cc2NC1=O)n1ccc(cc1=O)-c1c(F)ccc(Cl)c1F