Reaction Details
TargetPlasma kallikrein
LigandBDBM241441
Substrate/CompetitorBDBM241595
Meas. Tech.In Vitro Assay
Temperature310.15±n/a K
Ki 4.02±n/a nM
Citation Yang, WCorte, JRGilligan, PJPinto, DJEwing, WRDilger, AKWang, YFang, TPabbisetty, KBSmith, II, LM Dihydropyridone p1 as factor XIa inhibitors US Patent US9409908 Publication Date 8/9/2016
 
Plasma kallikrein
Name:Plasma kallikrein
Type:Protein
Mol. Mass.:71391.16
Organism:Homo sapiens (Human)
Description:P03952
Residue:638
BDBM241441
BDBM241595
NameBDBM241441
Synonyms:US9409908, 177 US9409908, 73 | US9951071, Example 73
TypeSmall organic molecule
Emp. Form.C32H31ClF2N4O4
Mol. Mass.609.063
SMILESCOC(=O)Nc1ccc-2c(NC(=O)[C@H](C)CCC[C@H](N3CC(C)C(=CC3=O)c3c(F)ccc(Cl)c3F)c3cc-2ccn3)c1