Reaction Details
TargetAcid ceramidase
LigandBDBM50431272
Substrate/Competitorn/a
Meas. Tech.Enzymatic Assay
pH4.5±n/a
IC50 67±n/a nM
Commentsextracted
Citation Piomelli, DRealini, NMor, MPagliuca, CPizzirani, DScarpelli, RBandiera, T Acid ceramidase inhibitors and their use as medicaments US Patent US9428465 Publication Date 8/30/2016
 
Acid ceramidase
Name:Acid ceramidase
Type:Enzyme
Mol. Mass.:44450.22
Organism:Rattus norvegicus (Rat)
Description:Q6P7S1
Residue:394
BDBM50431272
NameBDBM50431272
Synonyms:CHEMBL2333032 | US9428465, 3
TypeSmall organic molecule
Emp. Form.C11H16ClN3O3
Mol. Mass.273.716
SMILESCCCCCCNC(=O)n1cc(Cl)c(=O)[nH]c1=O