Reaction Details
TargetAcid ceramidase
LigandBDBM50431262
Substrate/Competitorn/a
Meas. Tech.Enzymatic Assay
pH4.5±n/a
IC50 51±n/a nM
Commentsextracted
Citation Piomelli, DRealini, NMor, MPagliuca, CPizzirani, DScarpelli, RBandiera, T Acid ceramidase inhibitors and their use as medicaments US Patent US9428465 Publication Date 8/30/2016
 
Acid ceramidase
Name:Acid ceramidase
Type:Enzyme
Mol. Mass.:44450.22
Organism:Rattus norvegicus (Rat)
Description:Q6P7S1
Residue:394
BDBM50431262
NameBDBM50431262
Synonyms:CHEMBL2333042 | US9428465, 5
TypeSmall organic molecule
Emp. Form.C11H16BrN3O3
Mol. Mass.318.167
SMILESCCCCCCNC(=O)n1cc(Br)c(=O)[nH]c1=O