Reaction Details
TargetAcid ceramidase
LigandBDBM50431266
Substrate/Competitorn/a
Meas. Tech.Enzymatic Assay
pH4.5±n/a
IC50 880±n/a nM
Commentsextracted
Citation Piomelli, DRealini, NMor, MPagliuca, CPizzirani, DScarpelli, RBandiera, T Acid ceramidase inhibitors and their use as medicaments US Patent US9428465 Publication Date 8/30/2016
 
Acid ceramidase
Name:Acid ceramidase
Type:Enzyme
Mol. Mass.:44450.22
Organism:Rattus norvegicus (Rat)
Description:Q6P7S1
Residue:394
BDBM50431266
NameBDBM50431266
Synonyms:CHEMBL2333038 | US9428465, 12
TypeSmall organic molecule
Emp. Form.C15H24N4O4
Mol. Mass.324.3755
SMILESCCCCCCNC(=O)n1cc(N2CCOCC2)c(=O)[nH]c1=O