Reaction Details
TargetSerum paraoxonase/arylesterase 1
LigandBDBM241973
Substrate/Competitorn/a
Meas. Tech.PON Activity Assay
Ki 2.00e+5± 2.0e+4 nM
Citation Dilek, EBKüfrevioglu, Ã¿Ä°Beydemir, Å¿ Impacts of some antibiotics on human serum paraoxonase 1 activity. J Enzyme Inhib Med Chem28:758-64 (2013) 
 
Serum paraoxonase/arylesterase 1
Name:Serum paraoxonase/arylesterase 1
Type:Enzyme
Mol. Mass.:39719.73
Organism:Homo sapiens (Human)
Description:P27169
Residue:355
BDBM241973
NameBDBM241973
Synonyms:Oxytetracycline hydrochloride
TypeSmall organic molecule
Emp. Form.C22H24N2O9
Mol. Mass.460.434
SMILESCN(C)[C@H]1[C@@H]2[C@@H](O)[C@H]3C(=C(O)c4c(O)cccc4[C@@]3(C)O)C(=O)[C@]2(O)C(O)=C(C(N)=O)C1=O