Reaction Details
TargetSerum paraoxonase/arylesterase 1
LigandBDBM241974
Substrate/Competitorn/a
Meas. Tech.PON Activity Assay
Ki 3.730e+6± 3.30e+5 nM
Citation Dilek, EBKüfrevioglu, Ã¿Ä°Beydemir, Å¿ Impacts of some antibiotics on human serum paraoxonase 1 activity. J Enzyme Inhib Med Chem28:758-64 (2013) 
 
Serum paraoxonase/arylesterase 1
Name:Serum paraoxonase/arylesterase 1
Type:Enzyme
Mol. Mass.:39719.73
Organism:Homo sapiens (Human)
Description:P27169
Residue:355
BDBM241974
NameBDBM241974
Synonyms:Netilmycin sulfate
TypeSmall organic molecule
Emp. Form.C21H41N5O7
Mol. Mass.475.5795
SMILESCCN[C@@H]1C[C@H](N)[C@H](O[C@H]2OC(CN)=CC[C@H]2N)[C@H](O)[C@H]1O[C@H]1OC[C@](C)(O)[C@H](NC)[C@H]1O