Reaction Details
TargetSerum paraoxonase/arylesterase 1
LigandBDBM241975
Substrate/Competitorn/a
Meas. Tech.PON Activity Assay
Ki 3.5800e+7± 6.400e+6 nM
Citation Dilek, EBKüfrevioglu, Ã¿Ä°Beydemir, Å¿ Impacts of some antibiotics on human serum paraoxonase 1 activity. J Enzyme Inhib Med Chem28:758-64 (2013) 
 
Serum paraoxonase/arylesterase 1
Name:Serum paraoxonase/arylesterase 1
Type:Enzyme
Mol. Mass.:39719.73
Organism:Homo sapiens (Human)
Description:P27169
Residue:355
BDBM241975
NameBDBM241975
Synonyms:Clindamycin phosphate
TypeSmall organic molecule
Emp. Form.C18H34ClN2O8PS
Mol. Mass.504.963
SMILESCCC[C@@H]1C[C@H](N(C)C1)C(=O)N[C@H]([C@H](C)Cl)[C@H]1O[C@H](SC)[C@H](OP(O)(O)=O)[C@@H](O)[C@H]1O