Reaction Details
TargetP2X purinoceptor 7
LigandBDBM242027
Substrate/Competitorn/a
Meas. Tech.Fluorescent Imaging Plate Reader (FLIPR) Assay
pH7.4±n/a
Temperature310.15±n/a K
IC50 3.9±n/a nM
Commentsextracted
Citation Kilburn, JPRasmussen, LKJessing, MEldemenky, EMChen, BJiang, Y Cyclic amines US Patent US9415055 Publication Date 8/16/2016
 
P2X purinoceptor 7
Name:P2X purinoceptor 7
Type:Protein
Mol. Mass.:68602.85
Organism:Homo sapiens (Human)
Description:Q99572
Residue:595
BDBM242027
NameBDBM242027
Synonyms:US9415055, 2,3-dichloro-N-[2-(6-chloro-3-pyridyl)-2-morpholino-ethyl]benzamide | US9593105, 28
TypeSmall organic molecule
Emp. Form.C18H18Cl3N3O2
Mol. Mass.414.713
SMILESClc1ccc(cn1)C(CNC(=O)c1cccc(Cl)c1Cl)N1CCOCC1